Target
MBT domain-containing protein 1
Ligand
BDBM50440571
Substrate
Meas. Tech.
ChEMBL_1300218 (CHEMBL3136682)
IC50
50000±n/a nM
Citation
 Camerino, MAZhong, NDong, ADickson, BMJames, LIBaughman, BMNorris, JLKireev, DBJanzen, WPArrowsmith, CHFrye, SV The structure-activity relationships of L3MBTL3 inhibitors: flexibility of the dimer interface. Medchemcomm 4:1501-1507 (2013)  
Target
Name:
MBT domain-containing protein 1
Synonyms:
MBT domain-containing protein 1 MBTD1 | MBTD1_HUMAN
Type:
Protein
Mol. Mass.:
70557.67
Organism:
Homo sapiens (Human)
Description:
Residue:
628
  
Inhibitor
Name:
BDBM50440571
Synonyms:
CHEMBL2426474
Type:
Small organic molecule
Emp. Form.:
C28H42N4O2
Mol. Mass.:
466.6587
SMILES:
O=C(N1CCC(CC1)N1CCCCC1)c1ccc(cc1)C(=O)N1CCC(CC1)N1CCCCC1
: