Target
Lethal(3)malignant brain tumor-like protein 1
Ligand
BDBM50440614
Substrate
Meas. Tech.
ChEMBL_1300219 (CHEMBL3136683)
IC50
8900±n/a nM
Citation
 Camerino, MAZhong, NDong, ADickson, BMJames, LIBaughman, BMNorris, JLKireev, DBJanzen, WPArrowsmith, CHFrye, SV The structure-activity relationships of L3MBTL3 inhibitors: flexibility of the dimer interface. Medchemcomm 4:1501-1507 (2013)  
Target
Name:
Lethal(3)malignant brain tumor-like protein 1
Synonyms:
H-l(3)mbt KIAA0681 L(3)mbt-like L3MBTL LMBL1_HUMAN
Type:
PROTEIN
Mol. Mass.:
92284.44
Organism:
Homo sapiens
Description:
ChEMBL_103624
Residue:
840
  
Inhibitor
Name:
BDBM50440614
Synonyms:
CHEMBL2426364
Type:
Small organic molecule
Emp. Form.:
C32H43N5O2
Mol. Mass.:
529.7161
SMILES:
O=C(N1CCC(CC1)N1CCCC1)c1ccc(C(=O)N2CCC(CC2)N2CCCC2)c(Nc2ccccc2)c1
: