Target
Lysine-specific demethylase 5A
Ligand
BDBM50440571
Substrate
Meas. Tech.
ChEMBL_1300214 (CHEMBL3136678)
IC50
>30000±n/a nM
Citation
 Camerino, MAZhong, NDong, ADickson, BMJames, LIBaughman, BMNorris, JLKireev, DBJanzen, WPArrowsmith, CHFrye, SV The structure-activity relationships of L3MBTL3 inhibitors: flexibility of the dimer interface. Medchemcomm 4:1501-1507 (2013)  
Target
Name:
Lysine-specific demethylase 5A
Synonyms:
Histone demethylase JARID1A Jumonji/ARID domain-containing protein 1A KDM5A_HUMAN RBBP-2 RBP2 | Retinoblastoma-binding protein 2
Type:
Protein
Mol. Mass.:
192091.79
Organism:
Homo sapiens (Human)
Description:
P29375
Residue:
1690
  
Inhibitor
Name:
BDBM50440571
Synonyms:
CHEMBL2426474
Type:
Small organic molecule
Emp. Form.:
C28H42N4O2
Mol. Mass.:
466.6587
SMILES:
O=C(N1CCC(CC1)N1CCCCC1)c1ccc(cc1)C(=O)N1CCC(CC1)N1CCCCC1
: