Target
Lethal(3)malignant brain tumor-like protein 3
Ligand
BDBM50496593
Substrate
Meas. Tech.
ChEMBL_1300220 (CHEMBL3136684)
IC50
62±n/a nM
Citation
 Camerino, MAZhong, NDong, ADickson, BMJames, LIBaughman, BMNorris, JLKireev, DBJanzen, WPArrowsmith, CHFrye, SV The structure-activity relationships of L3MBTL3 inhibitors: flexibility of the dimer interface. Medchemcomm 4:1501-1507 (2013)  
Target
Name:
Lethal(3)malignant brain tumor-like protein 3
Synonyms:
H-l(3)mbt-like protein 3 L(3)mbt-like protein 3 LMBL3_HUMAN Lethal(3)malignant brain tumor-like protein 3 (L3MBTL3) MBT1
Type:
Protein
Mol. Mass.:
88334.17
Organism:
Homo sapiens (Human)
Description:
Residue:
780
  
Inhibitor
Name:
BDBM50496593
Synonyms:
CHEMBL3134131
Type:
Small organic molecule
Emp. Form.:
C21H33N3
Mol. Mass.:
327.5068
SMILES:
C(Cc1ccc(cc1)N1CCC(CC1)N1CCCC1)N1CCCC1
: