Target
E3 ubiquitin-protein ligase UHRF1
Ligand
BDBM50440614
Substrate
Meas. Tech.
ChEMBL_1300215 (CHEMBL3136679)
IC50
>30000±n/a nM
Citation
 Camerino, MAZhong, NDong, ADickson, BMJames, LIBaughman, BMNorris, JLKireev, DBJanzen, WPArrowsmith, CHFrye, SV The structure-activity relationships of L3MBTL3 inhibitors: flexibility of the dimer interface. Medchemcomm 4:1501-1507 (2013)  
Target
Name:
E3 ubiquitin-protein ligase UHRF1
Synonyms:
6.3.2.- E3 ubiquitin-protein ligase UHRF1 ICBP90 NP95 Nuclear zinc finger protein Np95 RNF106 UHRF1 Ubiquitin-like PHD and RING finger domain-containing protein 1 hNp95 | hUHRF1
Type:
Protein
Mol. Mass.:
89822.48
Organism:
Homo sapiens (Human)
Description:
Residue:
793
  
Inhibitor
Name:
BDBM50440614
Synonyms:
CHEMBL2426364
Type:
Small organic molecule
Emp. Form.:
C32H43N5O2
Mol. Mass.:
529.7161
SMILES:
O=C(N1CCC(CC1)N1CCCC1)c1ccc(C(=O)N2CCC(CC2)N2CCCC2)c(Nc2ccccc2)c1
: