Target
Acyl-protein thioesterase 2
Ligand
BDBM50336546
Substrate
Meas. Tech.
ChEMBL_1300907 (CHEMBL3135194)
IC50
38±n/a nM
Citation
 Davda, DMartin, BR Acyl protein thioesterase inhibitors as probes of dynamic S-palmitoylation. Medchemcomm 5:268-276 (2014)  
Target
Name:
Acyl-protein thioesterase 2
Synonyms:
APT2 LYPA2_HUMAN Lysophospholipase II
Type:
Protein
Mol. Mass.:
24740.23
Organism:
Homo sapiens (Human)
Description:
O95372
Residue:
231
  
Inhibitor
Name:
BDBM50336546
Synonyms:
CHEMBL1673415 | Palmostatin B
Type:
Small organic molecule
Emp. Form.:
C23H36O4
Mol. Mass.:
376.5295
SMILES:
CCCCCCCCCC[C@H]1[C@H](CCc2ccc(OC)c(OC)c2)OC1=O
: