Target
1-deoxy-D-xylulose-5-phosphate synthase
Ligand
BDBM50496740
Substrate
Meas. Tech.
ChEMBL_1331618 (CHEMBL3225361)
Ki
>1000000±n/a nM
Citation
 Smith, JMVierling, RJMeyers, CF Selective inhibition of E. coli 1-deoxy-D-xylulose-5-phosphate synthase by acetylphosphonates(). Medchemcomm 3:65-67 (2012)  
Target
Name:
1-deoxy-D-xylulose-5-phosphate synthase
Synonyms:
1-Deoxy-D-xylulose-5-phosphate synthase (DXP synthase)) dxs | yajP
Type:
Protein
Mol. Mass.:
67617.17
Organism:
Escherichia coli K-12 (Enterobacteria)
Description:
Residue:
620
  
Inhibitor
Name:
BDBM50496740
Synonyms:
CHEMBL3220788
Type:
Small organic molecule
Emp. Form.:
C6H12LiO4P
Mol. Mass.:
186.072
SMILES:
[Li;v0+].[#6]-[#6]-[#6]-[#6]-[#6](=O)P([#8-])(=O)[#8]-[#6]
: