Target
2-amino-4-hydroxy-6-hydroxymethyldihydropteridine pyrophosphokinase
Ligand
BDBM50031533
Substrate
Meas. Tech.
ChEMBL_1335026 (CHEMBL3239457)
Kd
29000±n/a nM
Citation
 Yun, MKHoagland, DKumar, GWaddell, MBRock, COLee, REWhite, SW The identification, analysis and structure-based development of novel inhibitors of 6-hydroxymethyl-7,8-dihydropterin pyrophosphokinase. Bioorg Med Chem 22:2157-65 (2014)  
Target
Name:
2-amino-4-hydroxy-6-hydroxymethyldihydropteridine pyrophosphokinase
Synonyms:
2-amino-4-hydroxy-6-hydroxymethyldihydropteridine pyrophosphokinase 7,8-dihydro-6-hydroxymethylpterin-pyrophosphokinase HPPK_ECOLI PPPK | folK
Type:
PROTEIN
Mol. Mass.:
18075.55
Organism:
Escherichia coli (strain K12)
Description:
ChEMBL_108237
Residue:
159
  
Inhibitor
Name:
BDBM50031533
Synonyms:
CHEMBL3233202
Type:
Small organic molecule
Emp. Form.:
C13H10N6OS
Mol. Mass.:
298.323
SMILES:
Nc1nc2nc(SCc3ccc(cc3)C#N)[nH]c2c(=O)[nH]1
: