Target
Alcohol dehydrogenase S chain
Ligand
BDBM50497147
Substrate
Meas. Tech.
ChEMBL_1355376 (CHEMBL3279511)
Kd
560±n/a nM
Citation
 Fries, RWBohlken, DPPlapp, BV 3-Substituted pyrazole derivatives as inhibitors and inactivators of liver alcohol dehydrogenase. J Med Chem 22:356-9 (1979)  
Target
Name:
Alcohol dehydrogenase S chain
Synonyms:
1.1.1.1 Alcohol dehydrogenase S chain
Type:
PROTEIN
Mol. Mass.:
39633.49
Organism:
Equus caballus
Description:
ChEMBL_105061
Residue:
374
  
Inhibitor
Name:
BDBM50497147
Synonyms:
CHEMBL3276275
Type:
Small organic molecule
Emp. Form.:
C6H10N2O
Mol. Mass.:
126.1564
SMILES:
OCCCc1cn[nH]c1
: