Target
Cytochrome b-245 heavy chain
Ligand
BDBM50497265
Substrate
Meas. Tech.
ChEMBL_1390859 (CHEMBL3391327)
IC50
30000±n/a nM
Citation
 Cifuentes-Pagano, ESaha, JCsányi, GGhouleh, IASahoo, SRodríguez, AWipf, PPagano, PJSkoda, EM Bridged tetrahydroisoquinolines as selective NADPH oxidase 2 (Nox2) inhibitors. Medchemcomm 4:1085-1092 (2013)  
Target
Name:
Cytochrome b-245 heavy chain
Synonyms:
CGD91-phox CYBB Cytochrome b-245, beta polypeptide [Homo sapiens] Heme-binding membrane glycoprotein gp91phox NADPH oxidase 2 (NOX2) Neutrophil cytochrome b 91 kDa polypeptide gp91-1 p22 phagocyte B-cytochrome
Type:
Enzyme
Mol. Mass.:
65355.82
Organism:
Homo sapiens (Human)
Description:
P04839
Residue:
570
  
Inhibitor
Name:
BDBM50497265
Synonyms:
CHEMBL3347503
Type:
Small organic molecule
Emp. Form.:
C24H28FN
Mol. Mass.:
349.4842
SMILES:
[H][C@@]12CC(C)(C)[C@@]([H])([C@H](CC(C)=C)N1Cc1cccc(F)c1)c1ccccc21
: