Target
Cytochrome b-245 heavy chain
Ligand
BDBM50497271
Substrate
Meas. Tech.
ChEMBL_1390865 (CHEMBL3391333)
IC50
30±n/a nM
Citation
 Cifuentes-Pagano, ESaha, JCsányi, GGhouleh, IASahoo, SRodríguez, AWipf, PPagano, PJSkoda, EM Bridged tetrahydroisoquinolines as selective NADPH oxidase 2 (Nox2) inhibitors. Medchemcomm 4:1085-1092 (2013)  
Target
Name:
Cytochrome b-245 heavy chain
Synonyms:
CGD91-phox CYBB Cytochrome b-245, beta polypeptide [Homo sapiens] Heme-binding membrane glycoprotein gp91phox NADPH oxidase 2 (NOX2) Neutrophil cytochrome b 91 kDa polypeptide gp91-1 p22 phagocyte B-cytochrome
Type:
Enzyme
Mol. Mass.:
65355.82
Organism:
Homo sapiens (Human)
Description:
P04839
Residue:
570
  
Inhibitor
Name:
BDBM50497271
Synonyms:
CHEMBL3347550
Type:
Small organic molecule
Emp. Form.:
C22H32BrN
Mol. Mass.:
390.4
SMILES:
[H][C@@]12CC(C)(C)[C@@]([H])([C@H](CC(C)=C)N1CCCCC)c1c(Br)cccc21
: