Target
Alpha-2A adrenergic receptor
Ligand
BDBM50271255
Substrate
Meas. Tech.
ChEMBL_1442366 (CHEMBL3378324)
EC50
93±n/a nM
Citation
 Wasilewska, AS?czewski, FHudson, ALFerdousi, MScheinin, MLaurila, JMRybczy?ska, ABoblewski, KLehmann, A Fluorinated analogues of marsanidine, a highly ?2-AR/imidazoline I1 binding site-selective hypotensive agent. Synthesis and biological activities. Eur J Med Chem 87:386-97 (2014)  
Target
Name:
Alpha-2A adrenergic receptor
Synonyms:
ADA2A_HUMAN ADRA2R Adrenergic alpha2A Alpha-2 adrenergic receptor subtype C10 Alpha-2A adrenoreceptor alpha-2A adrenergic receptor [Homo sapiens]
Type:
Enzyme
Mol. Mass.:
48979.91
Organism:
Homo sapiens (Human)
Description:
P08913
Residue:
450
  
Inhibitor
Name:
BDBM50271255
Synonyms:
1-[(Imidazolidin-2-yl)imino]indazole hydrochloride CHEMBL454712
Type:
Small organic molecule
Emp. Form.:
C10H11N5
Mol. Mass.:
201.2278
SMILES:
[#6]-1-[#6]-[#7]\[#6](-[#7]-1)=[#7]/n1ncc2ccccc12
: