Target
M1 family aminopeptidase
Ligand
BDBM50497544
Substrate
Meas. Tech.
ChEMBL_1438459 (CHEMBL3384271)
Ki
0.800000±n/a nM
Citation
 Mistry, SNDrinkwater, NRuggeri, CSivaraman, KKLoganathan, SFletcher, SDrag, MPaiardini, AAvery, VMScammells, PJMcGowan, S Two-pronged attack: dual inhibition of Plasmodium falciparum M1 and M17 metalloaminopeptidases by a novel series of hydroxamic acid-based inhibitors. J Med Chem 57:9168-83 (2014)  
Target
Name:
M1 family aminopeptidase
Synonyms:
AMPN_PLAF7 Zinc aminopeptidase | m1-family aminopeptidase
Type:
PROTEIN
Mol. Mass.:
126072.31
Organism:
Plasmodium falciparum (isolate FcB1 / Columbia)
Description:
ChEMBL_735637
Residue:
1085
  
Inhibitor
Name:
BDBM50497544
Synonyms:
CHEMBL3359688
Type:
Small organic molecule
Emp. Form.:
C16H20N4O4
Mol. Mass.:
332.3544
SMILES:
CC(C)(C)OC(=O)NC(C(=O)NO)c1ccc(cc1)-n1cccn1
: