Target
M17 leucyl aminopeptidase
Ligand
BDBM50497552
Substrate
Meas. Tech.
ChEMBL_1438460 (CHEMBL3384272)
Ki
0.012000±n/a nM
Citation
 Mistry, SNDrinkwater, NRuggeri, CSivaraman, KKLoganathan, SFletcher, SDrag, MPaiardini, AAvery, VMScammells, PJMcGowan, S Two-pronged attack: dual inhibition of Plasmodium falciparum M1 and M17 metalloaminopeptidases by a novel series of hydroxamic acid-based inhibitors. J Med Chem 57:9168-83 (2014)  
Target
Name:
M17 leucyl aminopeptidase
Synonyms:
leucine aminopeptidase
Type:
Enzyme Catalytic Domain
Mol. Mass.:
67834.32
Organism:
Plasmodium falciparum 3D7
Description:
gi_124809582
Residue:
605
  
Inhibitor
Name:
BDBM50497552
Synonyms:
CHEMBL3359698
Type:
Small organic molecule
Emp. Form.:
C18H15FN4O3
Mol. Mass.:
354.3351
SMILES:
ONC(=O)C(NC(=O)c1ccc(F)cc1)c1ccc(cc1)-n1cccn1
: