Target
Kappa-type opioid receptor
Ligand
BDBM50045778
Substrate
Meas. Tech.
ChEBML_220942
Ki
2.3±n/a nM
Citation
 Mitch, CHLeander, JDMendelsohn, LGShaw, WNWong, DTCantrell, BEJohnson, BGReel, JKSnoddy, JDTakemori, AE 3,4-Dimethyl-4-(3-hydroxyphenyl)piperidines: opioid antagonists with potent anorectant activity. J Med Chem 36:2842-50 (1993)  
Target
Name:
Kappa-type opioid receptor
Synonyms:
Kappa Opioid Receptor OPRK1 Opiate Kappa 1 | mu/kappa opioid receptor
Type:
G Protein-Coupled Receptor (GPCR)
Mol. Mass.:
42744.99
Organism:
Cavia porcellus (domestic guinea pig)
Description:
P41144
Residue:
380
  
Inhibitor
Name:
BDBM50045778
Synonyms:
3-[1-(2-Cyclohexyl-ethyl)-3,4-dimethyl-piperidin-4-yl]-phenol | CHEMBL97509
Type:
Small organic molecule
Emp. Form.:
C21H33NO
Mol. Mass.:
315.4928
SMILES:
C[C@H]1CN(CCC2CCCCC2)CC[C@@]1(C)c1cccc(O)c1
: