Target
Amyloid-beta precursor protein
Ligand
BDBM50497743
Substrate
Meas. Tech.
ChEMBL_1455392 (CHEMBL3363288)
Ki
18±n/a nM
Citation
 Yang, YCui, MZhang, XDai, JZhang, ZLin, CGuo, YLiu, B Radioiodinated benzyloxybenzene derivatives: a class of flexible ligands target to ?-amyloid plaques in Alzheimer's brains. J Med Chem 57:6030-42 (2014)  
Target
Name:
Amyloid-beta precursor protein
Synonyms:
A4 ABPP AICD-50 AICD-59 AID(57) APP Alzheimer disease amyloid protein Amyloid beta Protein Amyloid beta protein Abeta(1-42) Amyloid intracellular domain 57 Amyloid protein (Abeta42b) Beta amyloid A4 protein Beta-APP42 Beta-amyloid protein 42 C83 CVAP Gamma Secretase Gamma-CTF(57) Gamma-secretase Gamma-secretase C-terminal fragment 57 P3(40) PN-II Protease nexin-II S-APP-beta Soluble APP-beta | beta-Amyloid Precursor Protein (APP)
Type:
Single-pass type I membrane protein
Mol. Mass.:
86890.41
Organism:
Homo sapiens (Human)
Description:
P05067
Residue:
770
  
Inhibitor
Name:
BDBM50497743
Synonyms:
CHEMBL3314340
Type:
Small organic molecule
Emp. Form.:
C15H16INO
Mol. Mass.:
353.1981
SMILES:
CN(C)c1ccc(OCc2ccc(I)cc2)cc1
: