Target
Muscarinic acetylcholine receptor M2
Ligand
BDBM50241132
Substrate
Meas. Tech.
ChEMBL_1455704 (CHEMBL3366379)
Ki
0.331131±n/a nM
Citation
 Schmitz, Jvan der Mey, DBermudez, MKlöckner, JSchrage, RKostenis, ETränkle, CWolber, GMohr, KHolzgrabe, U Dualsteric muscarinic antagonists--orthosteric binding pose controls allosteric subtype selectivity. J Med Chem 57:6739-50 (2014)  
Target
Name:
Muscarinic acetylcholine receptor M2
Synonyms:
ACM2_HUMAN Cholinergic, muscarinic M2 Muscarinic acetylcholine receptor M2 and M5 | RecName: Full=Muscarinic acetylcholine receptor M2
Type:
GPCR
Mol. Mass.:
51730.61
Organism:
Homo sapiens (Human)
Description:
P08172
Residue:
466
  
Inhibitor
Name:
BDBM50241132
Synonyms:
3-Hydroxy-2-phenyl-propionic acid 9-methyl-3-oxa-9-aza-tricyclo[3.3.1.0*2,4*]non-7-yl ester CHEMBL376897 Methyl scopolamine | N-METHYLSCOPOLAMINE
Type:
Small organic molecule
Emp. Form.:
C18H24NO4
Mol. Mass.:
318.3869
SMILES:
C[N+]1(C)[C@H]2C[C@@H](C[C@@H]1[C@H]1O[C@@H]21)OC(=O)[C@H](CO)c1ccccc1
: