Target
Anionic trypsin
Ligand
BDBM50046343
Substrate
Meas. Tech.
ChEBML_212173
EC50
26±n/a nM
Citation
 Balasubramanian, NSt Laurent, DRFederici, MEMeanwell, NAWright, JJSchumacher, WASeiler, SM Active site-directed synthetic thrombin inhibitors: synthesis, in vitro and in vivo activity profile of BMY 44621 and analogs. An examination of the role of the amino group in the D-Phe-Pro-Arg-H series. J Med Chem 36:300-3 (1993)  
Target
Name:
Anionic trypsin
Synonyms:
Anionic trypsin Trypsin II
Type:
PROTEIN
Mol. Mass.:
26281.39
Organism:
Bos taurus
Description:
ChEMBL_212177
Residue:
247
  
Inhibitor
Name:
BDBM50046343
Synonyms:
1-(4-Oxo-4-phenyl-butyryl)-pyrrolidine-2-carboxylic acid (1-formyl-4-guanidino-butyl)-amide | CHEMBL319227
Type:
Small organic molecule
Emp. Form.:
C21H29N5O4
Mol. Mass.:
415.4861
SMILES:
NC(=N)NCCCC(NC(=O)C1CCCN1C(=O)C(=O)CCc1ccccc1)C=O
: