Target
Integrase
Ligand
BDBM50498303
Substrate
Meas. Tech.
ChEMBL_1499863 (CHEMBL3583195)
IC50
16±n/a nM
Citation
 Pescatori, LMétifiot, MChung, SMasoaka, TCuzzucoli Crucitti, GMessore, APupo, GMadia, VNSaccoliti, FScipione, LTortorella, SDi Leva, FSCosconati, SMarinelli, LNovellino, ELe Grice, SFPommier, YMarchand, CCosti, RDi Santo, R N-Substituted Quinolinonyl Diketo Acid Derivatives as HIV Integrase Strand Transfer Inhibitors and Their Activity against RNase H Function of Reverse Transcriptase. J Med Chem 58:4610-23 (2015)  
Target
Name:
Integrase
Synonyms:
pol
Type:
PROTEIN
Mol. Mass.:
32203.43
Organism:
Human immunodeficiency virus 1
Description:
ChEMBL_106649
Residue:
288
  
Inhibitor
Name:
BDBM50498303
Synonyms:
CHEMBL3582057
Type:
Small organic molecule
Emp. Form.:
C20H14FNO5
Mol. Mass.:
367.3273
SMILES:
OC(=O)C(\O)=C\C(=O)c1cn(Cc2ccccc2F)c2ccccc2c1=O
: