Target
Tyrosine-protein phosphatase non-receptor type 9
Ligand
BDBM50498446
Substrate
Meas. Tech.
ChEMBL_1506349 (CHEMBL3599428)
IC50
69000±n/a nM
Citation
 He, RBai, YYu, ZHWu, LGunawan, AMZhang, ZY Diversity-Oriented Synthesis for Novel, Selective and Drug-like Inhibitors for a Phosphatase from Mycobacterium Tuberculosis. Medchemcomm 5:1496-1499 (2014)  
Target
Name:
Tyrosine-protein phosphatase non-receptor type 9
Synonyms:
3.1.3.48 PTP-MEG2 PTPase MEG2 Protein-tyrosine phosphatase MEG2 (PTP-Meg2) | Tyrosine-protein phosphatase non-receptor type 9
Type:
Mol. Mass.:
68030.33
Organism:
Homo sapiens (Human)
Description:
P43378
Residue:
593
  
Inhibitor
Name:
BDBM50498446
Synonyms:
CHEMBL3596431
Type:
Small organic molecule
Emp. Form.:
C14H9BrN2O3S
Mol. Mass.:
365.202
SMILES:
OC(=O)c1cc2sc(Nc3cccc(Br)c3)nc2cc1O
: