Target
Tyrosine-protein phosphatase non-receptor type 6
Ligand
BDBM50498446
Substrate
Meas. Tech.
ChEMBL_1506348 (CHEMBL3599427)
IC50
78000±n/a nM
Citation
 He, RBai, YYu, ZHWu, LGunawan, AMZhang, ZY Diversity-Oriented Synthesis for Novel, Selective and Drug-like Inhibitors for a Phosphatase from Mycobacterium Tuberculosis. Medchemcomm 5:1496-1499 (2014)  
Target
Name:
Tyrosine-protein phosphatase non-receptor type 6
Synonyms:
HCP PTP1C Protein tyrosine phosphatase SHP-1 (SHP-1) Protein-tyrosine phosphatase SHP-1 Tyrosine-protein phosphatase non-receptor type 6 | Tyrosine-protein phosphatase non-receptor type 6 (SHP1)
Type:
Protein
Mol. Mass.:
67570.41
Organism:
Homo sapiens (Human)
Description:
P29350
Residue:
595
  
Inhibitor
Name:
BDBM50498446
Synonyms:
CHEMBL3596431
Type:
Small organic molecule
Emp. Form.:
C14H9BrN2O3S
Mol. Mass.:
365.202
SMILES:
OC(=O)c1cc2sc(Nc3cccc(Br)c3)nc2cc1O
: