Target
Dihydrofolate reductase
Ligand
BDBM18792
Substrate
Meas. Tech.
ChEMBL_1525190 (CHEMBL3635311)
Kd
11770±n/a nM
Citation
 Srinivasan, BTonddast-Navaei, SSkolnick, J Ligand binding studies, preliminary structure-activity relationship and detailed mechanistic characterization of 1-phenyl-6,6-dimethyl-1,3,5-triazine-2,4-diamine derivatives as inhibitors of Escherichia coli dihydrofolate reductase. Eur J Med Chem 103:600-14 (2015)  
Target
Name:
Dihydrofolate reductase
Synonyms:
Dihydrofolate reductase (F31V) | dfrA17
Type:
Mol. Mass.:
17532.46
Organism:
Escherichia coli
Description:
Residue:
157
  
Inhibitor
Name:
BDBM18792
Synonyms:
1-(4-chlorophenyl)-6,6-dimethyl-1,6-dihydro-1,3,5-triazine-2,4-diamine Chlorazin | Cycloguanil
Type:
Small organic molecule
Emp. Form.:
C11H14ClN5
Mol. Mass.:
251.715
SMILES:
CC1(C)N=C(N)N=C(N)N1c1ccc(Cl)cc1
: