Target
Interleukin-1 receptor-associated kinase 4
Ligand
BDBM50499195
Substrate
Meas. Tech.
ChEMBL_1538243 (CHEMBL3737182)
Ki
0.340000±n/a nM
Citation
 Wang, ZSun, DJohnstone, SCao, ZGao, XJaen, JCLiu, JLively, SMiao, SSudom, ATomooka, CWalker, NPWright, MYan, XYe, QPowers, JP Discovery of potent, selective, and orally bioavailable inhibitors of interleukin-1 receptor-associate kinase-4. Bioorg Med Chem Lett 25:5546-50 (2015)  
Target
Name:
Interleukin-1 receptor-associated kinase 4
Synonyms:
IRAK-4 IRAK4_HUMAN Interleukin-1 receptor-associated kinase 4 (IRAK4) | Renal carcinoma antigen NY-REN-64
Type:
Protein
Mol. Mass.:
51519.08
Organism:
Homo sapiens (Human)
Description:
Q9NWZ3
Residue:
460
  
Inhibitor
Name:
BDBM50499195
Synonyms:
CHEMBL3735504
Type:
Small organic molecule
Emp. Form.:
C27H31F3N4O3
Mol. Mass.:
516.5552
SMILES:
CC(C)(C)C(=O)Nc1ccc2n([C@@H]3CC[C@H](CO)CC3)c(NC(=O)c3cccc(c3)C(F)(F)F)nc2c1
: