Target
Retinoic acid receptor beta
Ligand
BDBM50048292
Substrate
Meas. Tech.
ChEMBL_195496 (CHEMBL798917)
Ki
26±n/a nM
Citation
 Charpentier, BBernardon, JMEustache, JMillois, CMartin, BMichel, SShroot, B Synthesis, structure-affinity relationships, and biological activities of ligands binding to retinoic acid receptor subtypes. J Med Chem 38:4993-5006 (1996)  
Target
Name:
Retinoic acid receptor beta
Synonyms:
HAP NR1B2 RAR-beta RARB Retinoic acid receptor RXR-alpha/Retinoic acid receptor beta Retinoid receptor
Type:
PROTEIN
Mol. Mass.:
50498.70
Organism:
Homo sapiens (Human)
Description:
ChEMBL_1458015
Residue:
455
  
Inhibitor
Name:
BDBM50048292
Synonyms:
6-[4-Methoxy-3-(1-methyl-cyclohexyl)-phenyl]-naphthalene-2-carboxylic acid | CHEMBL345298
Type:
Small organic molecule
Emp. Form.:
C25H26O3
Mol. Mass.:
374.4721
SMILES:
COc1ccc(cc1C1(C)CCCCC1)-c1ccc2cc(ccc2c1)C(O)=O
: