Target
Retinoic acid receptor beta
Ligand
BDBM50048298
Substrate
Meas. Tech.
ChEMBL_195496 (CHEMBL798917)
Ki
210±n/a nM
Citation
 Charpentier, BBernardon, JMEustache, JMillois, CMartin, BMichel, SShroot, B Synthesis, structure-affinity relationships, and biological activities of ligands binding to retinoic acid receptor subtypes. J Med Chem 38:4993-5006 (1996)  
Target
Name:
Retinoic acid receptor beta
Synonyms:
HAP NR1B2 RAR-beta RARB Retinoic acid receptor RXR-alpha/Retinoic acid receptor beta Retinoid receptor
Type:
PROTEIN
Mol. Mass.:
50498.70
Organism:
Homo sapiens (Human)
Description:
ChEMBL_1458015
Residue:
455
  
Inhibitor
Name:
BDBM50048298
Synonyms:
6-(4,4-Dimethyl-chroman-6-yl)-naphthalene-2-carboxylic acid | CHEMBL342051
Type:
Small organic molecule
Emp. Form.:
C22H20O3
Mol. Mass.:
332.3924
SMILES:
CC1(C)CCOc2ccc(cc12)-c1ccc2cc(ccc2c1)C(O)=O
: