Target
Alpha-1,6-mannosyl-glycoprotein 2-beta-N-acetylglucosaminyltransferase
Ligand
BDBM50499290
Substrate
Meas. Tech.
ChEMBL_1538850 (CHEMBL3737425)
IC50
>10000±n/a nM
Citation
 Imbriglio, JEShen, DMLiang, RMarby, KYou, MYoum, HWFeng, ZLondon, CXiong, YTata, JVerras, AGarcia-Calvo, MSong, XAddona, GHMcLaren, DGHe, TMurphy, BMetzger, DESalituro, GDeckman, DChen, QJin, XStout, SJWang, SPWilsie, LPalyha, OHan, SHubbard, BKPrevis, SFPinto, STaggart, A Discovery and Pharmacology of a Novel Class of Diacylglycerol Acyltransferase 2 Inhibitors. J Med Chem 58:9345-53 (2015)  
Target
Name:
Alpha-1,6-mannosyl-glycoprotein 2-beta-N-acetylglucosaminyltransferase
Synonyms:
Beta-1,2-N-acetylglucosaminyltransferase II GlcNAc-T II Mannoside acetylglucosaminyltransferase 2 N-glycosyl-oligosaccharide-glycoprotein N-acetylglucosaminyltransferase II
Type:
PROTEIN
Mol. Mass.:
51045.37
Organism:
Mus musculus
Description:
ChEMBL_107583
Residue:
442
  
Inhibitor
Name:
BDBM50499290
Synonyms:
CHEMBL3734797
Type:
Small organic molecule
Emp. Form.:
C29H32F3N5O4
Mol. Mass.:
571.5907
SMILES:
Cc1noc(n1)[C@H]1C[C@@H]1C(=O)NCc1ccc(-c2cccc(OC(F)(F)F)c2)c2CCN(Cc12)C(=O)NC(C)(C)C
: