Target
1,3-beta-glucan synthase component GSC2
Ligand
BDBM97255
Substrate
Meas. Tech.
ChEMBL_1543360 (CHEMBL3743004)
Ki
4.8±n/a nM
Citation
 Yu, Zvan Veldhoven, JP't Hart, IMKopf, AHHeitman, LHIJzerman, AP Synthesis and biological evaluation of negative allosteric modulators of the Kv11.1(hERG) channel. Eur J Med Chem 106:50-9 (2015)  
Target
Name:
1,3-beta-glucan synthase component GSC2
Synonyms:
1,3-beta-D-glucan-UDP glucosyltransferase FK506 sensitivity protein 2 FKS2_YEAST GSC2 | Glucan synthase of cerevisiae protein 2
Type:
PROTEIN
Mol. Mass.:
216999.86
Organism:
Saccharomyces cerevisiae
Description:
ChEMBL_11143
Residue:
1895
  
Inhibitor
Name:
BDBM97255
Synonyms:
2-(1-bromanylnaphthalen-2-yl)oxy-N-pyridin-3-yl-ethanamide 2-(1-bromonaphthalen-2-yl)oxy-N-pyridin-3-ylacetamide MLS001125494 cid_1301094
Type:
Small organic molecule
Emp. Form.:
C17H13BrN2O2
Mol. Mass.:
357.201
SMILES:
Brc1c(OCC(=O)Nc2cccnc2)ccc2ccccc12
: