Target
Acid ceramidase
Ligand
BDBM367197
Substrate
Meas. Tech.
ChEMBL_1542475 (CHEMBL3743922)
IC50
20±n/a nM
Citation
 Bach, APizzirani, DRealini, NVozella, VRusso, DPenna, IMelzig, LScarpelli, RPiomelli, D Benzoxazolone Carboxamides as Potent Acid Ceramidase Inhibitors: Synthesis and Structure-Activity Relationship (SAR) Studies. J Med Chem 58:9258-72 (2015)  
Target
Name:
Acid ceramidase
Synonyms:
ASAH ASAH1_HUMAN Acid ceramidase (AC)
Type:
Enzyme
Mol. Mass.:
44662.65
Organism:
Homo sapiens (Human)
Description:
Q13510
Residue:
395
  
Inhibitor
Name:
BDBM367197
Synonyms:
2-oxo-N-(4-phenylbutyl)-6- (trifluoromethyl)-1,3- benzoxazole-3-carboxamide | US10226452, Example 14
Type:
Small organic molecule
Emp. Form.:
C19H17F3N2O3
Mol. Mass.:
378.3451
SMILES:
FC(F)(F)c1ccc2n(C(=O)NCCCCc3ccccc3)c(=O)oc2c1
: