Target
Acid ceramidase
Ligand
BDBM367194
Substrate
Meas. Tech.
ChEMBL_1542475 (CHEMBL3743922)
IC50
3.0±n/a nM
Citation
 Bach, APizzirani, DRealini, NVozella, VRusso, DPenna, IMelzig, LScarpelli, RPiomelli, D Benzoxazolone Carboxamides as Potent Acid Ceramidase Inhibitors: Synthesis and Structure-Activity Relationship (SAR) Studies. J Med Chem 58:9258-72 (2015)  
Target
Name:
Acid ceramidase
Synonyms:
ASAH ASAH1_HUMAN Acid ceramidase (AC)
Type:
Enzyme
Mol. Mass.:
44662.65
Organism:
Homo sapiens (Human)
Description:
Q13510
Residue:
395
  
Inhibitor
Name:
BDBM367194
Synonyms:
5-nitro-2-oxo-N-(4- phenylbutyl)-1,3- benzoxazole-3-carboxamide | US10226452, Example 11
Type:
Small organic molecule
Emp. Form.:
C18H17N3O5
Mol. Mass.:
355.3447
SMILES:
[O-][N+](=O)c1ccc2oc(=O)n(C(=O)NCCCCc3ccccc3)c2c1
: