Target
Transmembrane domain-containing protein TMIGD3
Ligand
BDBM50500118
Substrate
Meas. Tech.
ChEMBL_1546516 (CHEMBL3749019)
Ki
1.8±n/a nM
Citation
 Tosh, DKPaoletta, SChen, ZCrane, SLloyd, JGao, ZGGizewski, ETAuchampach, JASalvemini, DJacobson, KA Structure-Based Design, Synthesis by Click Chemistry and  Medchemcomm 6:555-563 
Target
Name:
Transmembrane domain-containing protein TMIGD3
Synonyms:
TMIG3_HUMAN Transmembrane domain-containing protein TMIGD3
Type:
PROTEIN
Mol. Mass.:
30335.79
Organism:
Homo sapiens (Human)
Description:
ChEMBL_114868
Residue:
266
  
Inhibitor
Name:
BDBM50500118
Synonyms:
CHEMBL3747756
Type:
Small organic molecule
Emp. Form.:
C21H22N10O3
Mol. Mass.:
462.4646
SMILES:
[H][C@]12C[C@]1([C@@H](O)[C@@H](O)[C@@H]2n1cnc2c(NC)nc(nc12)-n1cc(nn1)-c1ccccn1)C(=O)NC
: