Target
Adenosine receptor A3
Ligand
BDBM50500121
Substrate
Meas. Tech.
ChEMBL_1546517 (CHEMBL3749020)
Ki
14±n/a nM
Citation
 Tosh, DKPaoletta, SChen, ZCrane, SLloyd, JGao, ZGGizewski, ETAuchampach, JASalvemini, DJacobson, KA Structure-Based Design, Synthesis by Click Chemistry and  Medchemcomm 6:555-563 
Target
Name:
Adenosine receptor A3
Synonyms:
A3AR Adenosine A3 receptor Gpcr2
Type:
PROTEIN
Mol. Mass.:
36460.91
Organism:
Mus musculus
Description:
ChEMBL_1515686
Residue:
319
  
Inhibitor
Name:
BDBM50500121
Synonyms:
CHEMBL3745851
Type:
Small organic molecule
Emp. Form.:
C23H24ClN9O3S
Mol. Mass.:
542.013
SMILES:
[H][C@]12C[C@]1([C@@H](O)[C@@H](O)[C@@H]2n1cnc2c(NC3CCC3)nc(nc12)-n1cc(nn1)-c1ccc(Cl)s1)C(=O)NC
: