Target
Tyrosine-protein phosphatase non-receptor type 1
Ligand
BDBM50219566
Substrate
Meas. Tech.
ChEMBL_1546980 (CHEMBL3748083)
Ki
4.0±n/a nM
Citation
 Kozakov, DHall, DRNapoleon, RLYueh, CWhitty, AVajda, S New Frontiers in Druggability. J Med Chem 58:9063-88 (2015)  
Target
Name:
Tyrosine-protein phosphatase non-receptor type 1
Synonyms:
PTN1_HUMAN PTPN1 Protein tyrosine phosphatase-1B (PTP1B) Protein-tyrosine phosphatase 1B (PTP1B) Tyrosine-protein phosphatase non-receptor type 1 (PTP1B)
Type:
Protein phosphatase
Mol. Mass.:
49963.76
Organism:
Homo sapiens (Human)
Description:
Human recombinant GST-fusion PTP1B (1-435).
Residue:
435
  
Inhibitor
Name:
BDBM50219566
Synonyms:
4-bromo-3-carboxymethoxy-5-[3-(1-phenylmethanesulfonylpiperidin-4-ylamino)phenyl]thiophene-2-carboxylic acid 5-(3-{[1-(BENZYLSULFONYL)PIPERIDIN-4-YL]AMINO}PHENYL)-4-BROMO-3-(CARBOXYMETHOXY)THIOPHENE-2-CARBOXYLIC ACID | CHEMBL541214
Type:
Small organic molecule
Emp. Form.:
C25H25BrN2O7S2
Mol. Mass.:
609.509
SMILES:
OC(=O)COc1c(Br)c(sc1C(O)=O)-c1cccc(NC2CCN(CC2)S(=O)(=O)Cc2ccccc2)c1
: