Target
Neuropeptide Y receptor type 1
Ligand
BDBM50408041
Substrate
Meas. Tech.
ChEMBL_143828 (CHEMBL748713)
Ki
143±n/a nM
Citation
 Balasubramaniam, AZhai, WSheriff, STao, ZChance, WTFischer, JEEden, PTaylor, J Bis(31/31') ([CYS(31), Trp(32), Nva(34)] NPY-(31-36)): a specific NPY Y-1 receptor antagonist. J Med Chem 39:811-3 (1996)  
Target
Name:
Neuropeptide Y receptor type 1
Synonyms:
NPY-Y1 NPY1R NPYR neuropeptide Y receptor Y1
Type:
Enzyme Catalytic Domain
Mol. Mass.:
44399.07
Organism:
Homo sapiens (Human)
Description:
NPY-Y1 NPY1R HUMAN::P25929
Residue:
384
  
Inhibitor
Name:
BDBM50408041
Synonyms:
CHEMBL2110196
Type:
Small organic molecule
Emp. Form.:
C132H178N36O22S2
Mol. Mass.:
2685.184
SMILES:
CCC[C@H](NC(=O)[C@H](CCCNC(N)=N)NC(=O)[C@@H](Cc1c[nH]c2ccccc12)NC(=O)[C@H](CSSC[C@H](NC(=O)[C@H](CC(C)C)NC(=O)[C@H](Cc1c[nH]c2ccccc12)NC(=O)[C@@H](N)Cc1ccc(O)cc1)C(=O)N[C@H](Cc1c[nH]c2ccccc12)C(=O)N[C@@H](CCCNC(N)=N)C(=O)N[C@@H](CCC)C(=O)N[C@@H](CCCNC(N)=N)C(=O)N[C@@H](Cc1ccc(O)cc1)C(N)=O)NC(=O)[C@H](CC(C)C)NC(=O)[C@H](Cc1c[nH]c2ccccc12)NC(=O)[C@@H](N)Cc1ccc(O)cc1)C(=O)N[C@@H](CCCNC(N)=N)C(=O)N[C@@H](Cc1ccc(O)cc1)C(N)=O
: