Target
Adenosine receptor A2a
Ligand
BDBM50051232
Substrate
Meas. Tech.
ChEMBL_31063 (CHEMBL641347)
Ki
1.2±n/a nM
Citation
 Baraldi, PGCacciari, BSpalluto, GPineda de las Infantas y Villatoro, MJZocchi, CDionisotti, SOngini, E Pyrazolo[4,3-e]-1,2,4-triazolo[1,5-c]pyrimidine derivatives: potent and selective A(2A) adenosine antagonists. J Med Chem 39:1164-71 (1996)  
Target
Name:
Adenosine receptor A2a
Synonyms:
AA2AR_RAT Adenosine A2 receptor Adenosine Receptors A2a (A2a) Adenosine receptors A2a Rat striatal adenosine A2a receptor
Type:
G Protein-Coupled Receptor (GPCR)
Mol. Mass.:
45015.65
Organism:
Rattus norvegicus (rat)
Description:
Rat A2A receptors expressed in CHO cells.
Residue:
410
  
Inhibitor
Name:
BDBM50051232
Synonyms:
8-(4-Fluoro-benzyl)-2-furan-2-yl-8H-pyrazolo[4,3-e][1,2,4]triazolo[1,5-c]pyrimidin-5-ylamine | CHEMBL278906
Type:
Small organic molecule
Emp. Form.:
C17H12FN7O
Mol. Mass.:
349.3219
SMILES:
Nc1nc2nn(Cc3ccc(F)cc3)cc2c2nc(nn12)-c1ccco1
: