Target
Translocator protein
Ligand
BDBM22040
Substrate
Meas. Tech.
ChEMBL_39280 (CHEMBL650541)
IC50
10±n/a nM
Citation
 TenBrink, REBergh, CLDuncan, JNHarris, DWHuff, RMLahti, RALawson, CFLutzke, BSMartin, IJRees, SASchlachter, SKSih, JCSmith, MW (S)-(-)-4-[4-[2-(isochroman-1-yl)ethyl]-piperazin-1-yl] benzenesulfonamide, a selective dopamine D4 antagonist. J Med Chem 39:2435-7 (1996)  
Target
Name:
Translocator protein
Synonyms:
Bzrp Mitochondrial benzodiazepine receptor PKBS TSPO_MOUSE | Tspo
Type:
PROTEIN
Mol. Mass.:
18845.65
Organism:
Mus musculus
Description:
ChEMBL_39280
Residue:
169
  
Inhibitor
Name:
BDBM22040
Synonyms:
4 -chlorodiazepam 7-chloro-5-(4-chlorophenyl)-1-methyl-1,3-dihydro-2H-1,4-benzodiazepin-2-one CHEMBL286346 Ro-05-4864 Ro5-4864
Type:
Small organic molecule
Emp. Form.:
C16H12Cl2N2O
Mol. Mass.:
319.185
SMILES:
CN1c2ccc(Cl)cc2C(=NCC1=O)c1ccc(Cl)cc1
: