Target
Catenin beta-1/B-cell CLL/lymphoma 9 protein
Ligand
BDBM50501076
Substrate
Meas. Tech.
ChEMBL_1586628 (CHEMBL3821983)
Ki
170000±n/a nM
Citation
 Wisniewski, JAYin, JTeuscher, KBZhang, MJi, H Structure-Based Design of 1,4-Dibenzoylpiperazines as ?-Catenin/B-Cell Lymphoma 9 Protein-Protein Interaction Inhibitors. ACS Med Chem Lett 7:508-13 (2016)  
Target
Name:
Catenin beta-1/B-cell CLL/lymphoma 9 protein
Synonyms:
B-cell CLL/lymphoma 9 protein/Catenin beta-1 beta-catenin/B-cell lymphoma 9
Type:
Enzyme
Mol. Mass.:
Description:
Components:
This complex has 2 components.
Component 1
Name:
Catenin beta-1
Synonyms:
CTNB1_HUMAN CTNNB1
Type:
PROTEIN
Mol. Mass.:
85484.08
Organism:
Homo sapiens (Human)
Description:
ChEMBL_1504364
Residue:
781
  
Component 2
Name:
B-cell CLL/lymphoma 9 protein
Synonyms:
B-cell CLL/lymphoma 9 protein BCL9 Bcl-9 | Protein legless homolog
Type:
PROTEIN
Mol. Mass.:
149313.19
Organism:
Homo sapiens
Description:
ChEMBL_117069
Residue:
1426
  
Inhibitor
Name:
BDBM50501076
Synonyms:
CHEMBL3819443
Type:
Small organic molecule
Emp. Form.:
C34H48Cl2FN5O3
Mol. Mass.:
664.681
SMILES:
Cl.Cl.CCC1CCC(CC1)c1cc(ccc1O[C@H]1CCNC1)C(=O)N1CCN(CC1)C(=O)c1cc(F)cc(c1)N1CCNCC1
: