Target
B-cell CLL/lymphoma 9 protein
Ligand
BDBM50501087
Substrate
Meas. Tech.
ChEMBL_1586628 (CHEMBL3821983)
Ki
130000±n/a nM
Citation
 Wisniewski, JAYin, JTeuscher, KBZhang, MJi, H Structure-Based Design of 1,4-Dibenzoylpiperazines as ?-Catenin/B-Cell Lymphoma 9 Protein-Protein Interaction Inhibitors. ACS Med Chem Lett 7:508-13 (2016)  
Target
Name:
B-cell CLL/lymphoma 9 protein
Synonyms:
B-cell CLL/lymphoma 9 protein BCL9 Bcl-9 | Protein legless homolog
Type:
PROTEIN
Mol. Mass.:
149313.19
Organism:
Homo sapiens
Description:
ChEMBL_117069
Residue:
1426
  
Inhibitor
Name:
BDBM50501087
Synonyms:
CHEMBL3818840
Type:
Small organic molecule
Emp. Form.:
C15H16ClFN2O2
Mol. Mass.:
310.751
SMILES:
Cl.NCCOc1ccc(cc1-c1ccc(F)cc1)C(N)=O
: