Target
Genome polyprotein
Ligand
BDBM50501212
Substrate
Meas. Tech.
ChEMBL_1614753 (CHEMBL3856822)
IC50
110±n/a nM
Citation
 Kim, BKKo, HJeon, ESJu, ESJeong, LSKim, YC 2,3,4-Trihydroxybenzyl-hydrazide analogues as novel potent coxsackievirus B3 3C protease inhibitors. Eur J Med Chem 120:202-16 (2016)  
Target
Name:
Genome polyprotein
Synonyms:
3C-like proteinase (CVB3 3Cpro) P1A P1C P2A P2C P3B P3D-POL Picornain 3C Protease 2A Protein 2A Protein 2C Protein 3B Protein VP1 Protein VP3 RNA-directed RNA polymerase 3D-POL VPg Virion protein 2 Virion protein 4
Type:
Enzyme
Mol. Mass.:
243464.96
Organism:
Coxsackievirus B3 (strain Nancy)
Description:
P03313
Residue:
2185
  
Inhibitor
Name:
BDBM50501212
Synonyms:
CHEMBL3924623
Type:
Small organic molecule
Emp. Form.:
C18H20N2O5
Mol. Mass.:
344.3618
SMILES:
Oc1ccc(CCCCC(=O)N\N=C\c2ccc(O)c(O)c2O)cc1
: