Target
Histone-lysine N-methyltransferase EHMT1
Ligand
BDBM50501523
Substrate
Meas. Tech.
ChEMBL_1656137 (CHEMBL4005607)
IC50
12±n/a nM
Citation
 Xiong, YLi, FBabault, NDong, AZeng, HWu, HChen, XArrowsmith, CHBrown, PJLiu, JVedadi, MJin, J Discovery of Potent and Selective Inhibitors for G9a-Like Protein (GLP) Lysine Methyltransferase. J Med Chem 60:1876-1891 (2017)  
Target
Name:
Histone-lysine N-methyltransferase EHMT1
Synonyms:
EHMT1 EUHMTASE1 Euchromatic histone-lysine N-methyltransferase 1 GLP H3-K9-HMTase 5 Histone-lysine N-methyltransferase EHMT1/EHMT2 KMT1D | Lysine N-methyltransferase 1D
Type:
PROTEIN
Mol. Mass.:
141443.67
Organism:
Homo sapiens (Human)
Description:
ChEMBL_1450367
Residue:
1298
  
Inhibitor
Name:
BDBM50501523
Synonyms:
CHEMBL4063569
Type:
Small organic molecule
Emp. Form.:
C20H29N5O2
Mol. Mass.:
371.4766
SMILES:
COc1cc2nc(nc(NC3CCN(C)CC3)c2cc1OC)N1CCCC1
: