Target
Protein kinase C alpha type
Ligand
BDBM50052038
Substrate
Meas. Tech.
ChEMBL_162574 (CHEMBL768516)
IC50
3500±n/a nM
Citation
 Jirousek, MRGillig, JRGonzalez, CMHeath, WFMcDonald, JHNeel, DARito, CJSingh, UStramm, LEMelikian-Badalian, ABaevsky, MBallas, LMHall, SEWinneroski, LLFaul, MM (S)-13-[(dimethylamino)methyl]-10,11,14,15-tetrahydro-4,9:16, 21-dimetheno-1H, 13H-dibenzo[e,k]pyrrolo[3,4-h][1,4,13]oxadiazacyclohexadecene-1,3(2H)-d ione (LY333531) and related analogues: isozyme selective inhibitors of protein kinase C beta. J Med Chem 39:2664-71 (1996)  
Target
Name:
Protein kinase C alpha type
Synonyms:
KPCA_HUMAN PKC alpha and beta-2 PKC-alpha PRKACA Protein Kinase C- alpha Protein kinase C alpha (PKCa) Protein kinase C alpha type (PRKCA) RAF proto-oncogene serine/threonine-protein kinase
Type:
Enzyme
Mol. Mass.:
76755.65
Organism:
Homo sapiens (Human)
Description:
The recombinant human PKC enzymes were produced using a baculovirus expression system in SF9 cells
Residue:
672
  
Inhibitor
Name:
BDBM50052038
Synonyms:
18-tetrahydro-1H-1-pyrrolylmethyl-(18S)-17-oxa-4,14,21-triazahexacyclo[19.6.1.17,14.02,6.08,13.022,27]nonacosa-1(28),2(6),7(29),8(13),9,11,22(27),23,25-nonaene-3,5-dione | CHEMBL419866
Type:
Small organic molecule
Emp. Form.:
C30H30N4O3
Mol. Mass.:
494.5842
SMILES:
O=C1NC(=O)C2=C1c1cn(CCO[C@H](CN3CCCC3)CCn3cc2c2ccccc32)c2ccccc12
: