Target
5-hydroxytryptamine receptor 2B
Ligand
BDBM50052337
Substrate
Meas. Tech.
ChEMBL_2492 (CHEMBL617379)
Ki
1.15±n/a nM
Citation
 Monte, APMarona-Lewicka, DParker, MAWainscott, DBNelson, DLNichols, DE Dihydrobenzofuran analogues of hallucinogens. 3. Models of 4-substituted (2,5-dimethoxyphenyl)alkylamine derivatives with rigidified methoxy groups. J Med Chem 39:2953-61 (1996)  
Target
Name:
5-hydroxytryptamine receptor 2B
Synonyms:
5-HT-2B 5-hydroxytryptamine (serotonin) receptor 2B [Homo sapiens] 5-hydroxytryptamine receptor 2C (5HT2C) HTR2B Serotonin 2b (5-HT2b) receptor | Serotonin Receptor 2B
Type:
G Protein-Coupled Receptor (GPCR)
Mol. Mass.:
54312.47
Organism:
Homo sapiens (Human)
Description:
Receptor binding assays were performed using human clone stably expressed in CHO cells.
Residue:
481
  
Inhibitor
Name:
BDBM50052337
Synonyms:
2-(8-bromo-2,3,6,7-tetrahydro-benzo[1,2-b;4,5-b']difuran-4-yl)-1-methyl-ethylamine | CHEMBL101008
Type:
Small organic molecule
Emp. Form.:
C13H16BrNO2
Mol. Mass.:
298.176
SMILES:
CC(N)Cc1c2CCOc2c(Br)c2CCOc12
: