Target
Glutamate receptor ionotropic, NMDA 1/2B
Ligand
BDBM50062599
Substrate
Meas. Tech.
ChEMBL_1807946 (CHEMBL4307305)
Ki
1000±n/a nM
Citation
 Pérez-Areales, FJTurcu, ALBarniol-Xicota, MPont, CPivetta, DEspargaró, ABartolini, MDe Simone, AAndrisano, VPérez, BSabate, RSureda, FXVázquez, SMuñoz-Torrero, D A novel class of multitarget anti-Alzheimer benzohomoadamantane?chlorotacrine hybrids modulating cholinesterases and glutamate NMDA receptors. Eur J Med Chem 180:613-626 (2019)  
Target
Name:
Glutamate receptor ionotropic, NMDA 1/2B
Synonyms:
GluN1/GluN2B NMDA receptor Glutamate [NMDA] receptor subunit epsilon 2/zeta 1 nr2b nam
Type:
Enzyme
Mol. Mass.:
Description:
Components:
This complex has 2 components.
Component 1
Name:
Glutamate receptor ionotropic, NMDA 1
Synonyms:
GRIN1 Glutamate [NMDA] receptor subunit zeta-1 N-methyl-D-aspartate receptor subunit NR1 NMDZ1_HUMAN | phencyclidine
Type:
Enzyme Catalytic Domain
Mol. Mass.:
105397.81
Organism:
Homo sapiens (Human)
Description:
Q05586
Residue:
938
  
Component 2
Name:
Glutamate receptor ionotropic, NMDA 2B
Synonyms:
GRIN2B Glutamate [NMDA] receptor subunit epsilon 2 N-methyl D-aspartate receptor subtype 2B NMDAR2B NR3 | hNR3
Type:
PROTEIN
Mol. Mass.:
166375.46
Organism:
Homo sapiens (Human)
Description:
ChEMBL_1438829
Residue:
1484
  
Inhibitor
Name:
BDBM50062599
Synonyms:
3,5-Dimethyl-adamantan-1-ylamine EN300-123026 Namenda | US10214478, Compound memantine
Type:
Small organic molecule
Emp. Form.:
C12H21N
Mol. Mass.:
179.3018
SMILES:
CC12CC3CC(C)(C1)CC(N)(C3)C2
: