Target
5-hydroxytryptamine receptor 1A
Ligand
BDBM194780
Substrate
Meas. Tech.
ChEMBL_1808982 (CHEMBL4308341)
Ki
0.090000±n/a nM
Citation
 Ku?aga, DJa?kowska, JSata?a, G Design, synthesis and biological evaluation of novel serotonin and dopamine receptor ligands being 6-bromohexyl saccharine derivatives. Bioorg Med Chem Lett 29:0 (2019)  
Target
Name:
5-hydroxytryptamine receptor 1A
Synonyms:
5-HT-1A 5-HT1A 5-hydroxytryptamine receptor 1A (5HT1A) 5ht1a Htr1a Serotonin 1a (5-HT1a) receptor/Adrenergic receptor alpha-1 | Serotonin receptor 1A
Type:
G Protein-Coupled Receptor (GPCR)
Mol. Mass.:
46445.29
Organism:
Rattus norvegicus (rat)
Description:
Binding assays were performed using rat hippocampal membranes.
Residue:
422
  
Inhibitor
Name:
BDBM194780
Synonyms:
7-(4-(4-(1-benzothiophen-4-yl)piperazin-1-yl)butoxy)quinolin-2(1H)-one Rexulti USRE48059, Compound of Example 1 | brexpiprazole
Type:
Small organic molecule
Emp. Form.:
C25H27N3O2S
Mol. Mass.:
433.566
SMILES:
O=c1ccc2ccc(OCCCCN3CCN(CC3)c3cccc4sccc34)cc2[nH]1
: