Target
Cruzipain
Ligand
BDBM50502821
Substrate
Meas. Tech.
ChEMBL_1809002 (CHEMBL4308361)
Ki
5620±n/a nM
Citation
 Gomes, JCCianni, LRibeiro, JDos Reis Rocho, Fda Costa Martins Silva, SBatista, PHJMoraes, CBFranco, CHFreitas-Junior, LHGKenny, PWLeitão, ABurtoloso, ACBde Vita, DMontanari, CA Synthesis and structure-activity relationship of nitrile-based cruzain inhibitors incorporating a trifluoroethylamine-based P2 amide replacement. Bioorg Med Chem 27:0 (2019)  
Target
Name:
Cruzipain
Synonyms:
CYSP_TRYCR Cruzaine | Major cysteine proteinase
Type:
Protein
Mol. Mass.:
49831.41
Organism:
Trypanosoma cruzi
Description:
P25779
Residue:
467
  
Inhibitor
Name:
BDBM50502821
Synonyms:
CHEMBL4580196
Type:
Small organic molecule
Emp. Form.:
C21H20F3N3O
Mol. Mass.:
387.3982
SMILES:
FC(F)(F)[C@H](N[C@@H](Cc1ccccc1)C(=O)NC1(CC1)C#N)c1ccccc1
: