Target
Aurora kinase A
Ligand
BDBM50277545
Substrate
Meas. Tech.
ChEMBL_1812068 (CHEMBL4311528)
IC50
1.2±n/a nM
Citation
 Sang, CYQin, WWZhang, XJXu, YMa, YZWang, XRHui, LChen, SW Synthesis and identification of 2,4-bisanilinopyrimidines bearing 2,2,6,6-tetramethylpiperidine-N-oxyl as potential Aurora A inhibitors. Bioorg Med Chem 27:65-78 (2019)  
Target
Name:
Aurora kinase A
Synonyms:
AIK ARK1 AURKA AYK1 Aurora kinase A (AURA) Aurora kinase A (Aurora A) Aurora-related kinase 1 BTAK Breast-tumor-amplified kinase STK15 Serine/threonine kinase 15 Serine/threonine-protein kinase aurora A hARK1
Type:
Serine/threonine-protein kinase
Mol. Mass.:
45830.98
Organism:
Homo sapiens (Human)
Description:
O14965
Residue:
403
  
Inhibitor
Name:
BDBM50277545
Synonyms:
4-(9-chloro-7-(2-fluoro-6-methoxyphenyl)-5H-benzo[c]pyrimido[4,5-e]azepin-2-ylamino)-2-methoxybenzoic acid CHEMBL483158 US10092556, Example MLN8237 | US9346787, MLN8237
Type:
Small organic molecule
Emp. Form.:
C27H20ClFN4O4
Mol. Mass.:
518.924
SMILES:
COc1cc(Nc2ncc3CN=C(c4cc(Cl)ccc4-c3n2)c2c(F)cccc2OC)ccc1C(O)=O
: