Target
D(2) dopamine receptor
Ligand
BDBM50054709
Substrate
Meas. Tech.
ChEMBL_58195 (CHEMBL670363)
IC50
25±n/a nM
Citation
 Norman, MHNavas, FThompson, JBRigdon, GC Synthesis and evaluation of heterocyclic carboxamides as potential antipsychotic agents. J Med Chem 39:4692-703 (1997)  
Target
Name:
D(2) dopamine receptor
Synonyms:
DOPAMINE D2 Dopamine D2 receptor Drd2
Type:
Enzyme
Mol. Mass.:
50957.64
Organism:
Mus musculus (Mouse)
Description:
P61168
Residue:
444
  
Inhibitor
Name:
BDBM50054709
Synonyms:
CHEMBL141494 | N-[4-(4-Benzo[d]isothiazol-3-yl-piperazin-1-yl)-butyl]-isonicotinamide
Type:
Small organic molecule
Emp. Form.:
C21H25N5OS
Mol. Mass.:
395.521
SMILES:
O=C(NCCCCN1CCN(CC1)c1nsc2ccccc12)c1ccncc1
: