Target
Acidic mammalian chitinase
Ligand
BDBM50504014
Substrate
Meas. Tech.
ChEMBL_1813251 (CHEMBL4312825)
IC50
68±n/a nM
Citation
 Mazur, MDymek, BKoralewski, RSklepkiewicz, POlejniczak, SMazurkiewicz, MPiotrowicz, MSalamon, MJ?drzejczak, KZagozdzon, ACzestkowski, WMatyszewski, KBorek, BBartoszewicz, APluta, ERymaszewska, AMozga, WStefaniak, FDobrza?ski, PDzwonek, KGolab, JGolebiowski, AOlczak, J Development of Dual Chitinase Inhibitors as Potential New Treatment for Respiratory System Diseases. J Med Chem 62:7126-7145 (2019)  
Target
Name:
Acidic mammalian chitinase
Synonyms:
AMCase Chia YNL
Type:
PROTEIN
Mol. Mass.:
51991.60
Organism:
Mus musculus
Description:
ChEMBL_828636
Residue:
473
  
Inhibitor
Name:
BDBM50504014
Synonyms:
CHEMBL4547227
Type:
Small organic molecule
Emp. Form.:
C18H25ClN6O
Mol. Mass.:
376.884
SMILES:
Nc1n[nH]c(n1)N1CCC(CC1)N1C[C@H](O)C[C@@H]1Cc1ccc(Cl)cc1
: