Target
Chitotriosidase-1
Ligand
BDBM50504025
Substrate
Meas. Tech.
ChEMBL_1813252 (CHEMBL4312826)
IC50
21±n/a nM
Citation
 Mazur, MDymek, BKoralewski, RSklepkiewicz, POlejniczak, SMazurkiewicz, MPiotrowicz, MSalamon, MJ?drzejczak, KZagozdzon, ACzestkowski, WMatyszewski, KBorek, BBartoszewicz, APluta, ERymaszewska, AMozga, WStefaniak, FDobrza?ski, PDzwonek, KGolab, JGolebiowski, AOlczak, J Development of Dual Chitinase Inhibitors as Potential New Treatment for Respiratory System Diseases. J Med Chem 62:7126-7145 (2019)  
Target
Name:
Chitotriosidase-1
Synonyms:
CHIT1 Chitinase 1 Chitotriosidase Chitotriosidase-1 (CHIT1)
Type:
Enzyme
Mol. Mass.:
51682.25
Organism:
Homo sapiens (Human)
Description:
Q13231
Residue:
466
  
Inhibitor
Name:
BDBM50504025
Synonyms:
CHEMBL4464754
Type:
Small organic molecule
Emp. Form.:
C21H31ClN6O
Mol. Mass.:
418.963
SMILES:
Nc1n[nH]c(n1)N1CCC(CC1)N(CCc1ccc(Cl)cc1)CC1CCCCO1
: