Target
M-phase inducer phosphatase 2
Ligand
BDBM52026
Substrate
Meas. Tech.
ChEMBL_1813306 (CHEMBL4312880)
Ki
69000±n/a nM
Citation
 Cerchia, CNasso, RMori, MVilla, SGelain, ACapasso, AAliotta, FSimonetti, MRullo, RMasullo, MDe Vendittis, ERuocco, MRLavecchia, A Discovery of Novel Naphthylphenylketone and Naphthylphenylamine Derivatives as Cell Division Cycle 25B (CDC25B) Phosphatase Inhibitors: Design, Synthesis, Inhibition Mechanism, and in Vitro Efficacy against Melanoma Cell Lines. J Med Chem 62:7089-7110 (2019)  
Target
Name:
M-phase inducer phosphatase 2
Synonyms:
CDC25B Dual specificity phosphatase (CDC25B) M-phase inducer phosphatase 2 (CDC25B) | MPIP2_HUMAN
Type:
Protein
Mol. Mass.:
64985.27
Organism:
Homo sapiens (Human)
Description:
Residue:
580
  
Inhibitor
Name:
BDBM52026
Synonyms:
2-(1-naphthoyl)benzoic acid 2-[1-naphthalenyl(oxo)methyl]benzoic acid MLS001195141 cid_78723
Type:
Small organic molecule
Emp. Form.:
C18H12O3
Mol. Mass.:
276.2861
SMILES:
OC(=O)c1ccccc1C(=O)c1cccc2ccccc12
: