Target
Alpha-2A adrenergic receptor
Ligand
BDBM34572
Substrate
Meas. Tech.
ChEMBL_33066 (CHEMBL647965)
Ki
2.7±n/a nM
Citation
 Munk, SAHarcourt, DAArasasingham, PNBurke, JAKharlamb, ABManlapaz, CAPadillo, EURoberts, DRunde, EWilliams, LWheeler, LAGarst, ME Synthesis and evaluation of 2-(arylamino)imidazoles as alpha 2-adrenergic agonists. J Med Chem 40:18-23 (1997)  
Target
Name:
Alpha-2A adrenergic receptor
Synonyms:
ADA2A_HUMAN ADRA2R Adrenergic alpha2A Alpha-2 adrenergic receptor subtype C10 Alpha-2A adrenoreceptor alpha-2A adrenergic receptor [Homo sapiens]
Type:
Enzyme
Mol. Mass.:
48979.91
Organism:
Homo sapiens (Human)
Description:
P08913
Residue:
450
  
Inhibitor
Name:
BDBM34572
Synonyms:
BRIMONIDINE MLS000069370 UK 14,304 | cid_2435
Type:
Small organic molecule
Emp. Form.:
C11H10BrN5
Mol. Mass.:
292.135
SMILES:
Brc1c(NC2=NCCN2)ccc2nccnc12
: